FreeOrion

Forums for the FreeOrion project
It is currently Sun Nov 19, 2017 3:21 am

All times are UTC




Post new topic Reply to topic  [ 3 posts ] 
Author Message
PostPosted: Mon Sep 26, 2016 5:45 pm 
Offline
Juggernaut

Joined: Mon Feb 04, 2013 10:15 pm
Posts: 757
Any ideas?

Code:
[100%] Building CXX object client/human/CMakeFiles/freeorion.dir/__/__/UI/TextBrowseWnd.cpp.o
/home/andrew/Games/freeorion/UI/TechTreeWnd.cpp: In member function ‘virtual void TechTreeWnd::LayoutPanel::TechPanel::PreRender()’:
/home/andrew/Games/freeorion/UI/TechTreeWnd.cpp:750:12: warning: suggest explicit braces to avoid ambiguous ‘else’ [-Wparentheses]
         if (const Empire* empire = GetEmpire(HumanClientApp::GetApp()->EmpireID()))
            ^
In file included from /home/andrew/Games/freeorion/UI/../client/human/../../util/OptionsDB.h:6:0,
                 from /home/andrew/Games/freeorion/UI/../client/human/HumanClientApp.h:7,
                 from /home/andrew/Games/freeorion/UI/TechTreeWnd.cpp:10:
/home/andrew/Games/freeorion/UI/../client/human/../../util/OptionValidators.h: In instantiation of ‘boost::any RangedStepValidator<T>::Validate(const string&) const [with T = double; std::string = std::basic_string<char>]’:
/home/andrew/Games/freeorion/UI/TechTreeWnd.cpp:2211:1:   required from here
/home/andrew/Games/freeorion/UI/../client/human/../../util/OptionValidators.h:121:40: warning: suggest parentheses around ‘&&’ within ‘||’ [-Wparentheses]
         if (val < m_min || val > m_max ||
                                        ^
Linking CXX executable ../../freeorion

...

/usr/lib/gcc/x86_64-linux-gnu/4.9/../../../x86_64-linux-gnu/libboost_python.so: undefined reference to `PyComplex_ImagAsDouble'
collect2: error: ld returned 1 exit status
client/human/CMakeFiles/freeorion.dir/build.make:1783: recipe for target 'freeorion' failed
make[2]: *** [freeorion] Error 1
CMakeFiles/Makefile2:468: recipe for target 'client/human/CMakeFiles/freeorion.dir/all' failed
make[1]: *** [client/human/CMakeFiles/freeorion.dir/all] Error 2
Makefile:127: recipe for target 'all' failed
make: *** [all] Error 2


Top
 Profile  
 
PostPosted: Mon Sep 26, 2016 6:37 pm 
Offline
Programmer
User avatar

Joined: Fri Mar 01, 2013 9:52 am
Posts: 1040
Location: Germany
Should be fixed with 755f13e.

_________________
Resident code gremlin
Attached patches are released under GPL 2.0 or later.
Git author: Marcel Metz


Top
 Profile  
 
PostPosted: Mon Sep 26, 2016 9:55 pm 
Offline
Juggernaut

Joined: Mon Feb 04, 2013 10:15 pm
Posts: 757
adrian_broher wrote:
Should be fixed with 755f13e.


Compiles fine now, thanks.


Top
 Profile  
 
Display posts from previous:  Sort by  
Post new topic Reply to topic  [ 3 posts ] 

All times are UTC


Who is online

Users browsing this forum: No registered users and 1 guest


You cannot post new topics in this forum
You cannot reply to topics in this forum
You cannot edit your posts in this forum
You cannot delete your posts in this forum
You cannot post attachments in this forum

Search for:
Jump to:  
Powered by phpBB® Forum Software © phpBB Group